Target
Steroidogenic factor 1
Ligand
BDBM39458
Substrate
Meas. Tech.
Dose-response cell-based assay for activators of the nuclear receptor Steroidogenic Factor 1 (SF-1)
EC50
>3667±n/a nM
Citation
 PubChem, PC Dose-response cell-based assay for activators of the nuclear receptor Steroidogenic Factor 1 (SF-1) PubChem Bioassay (2007)[AID] 
Target
Name:
Steroidogenic factor 1
Synonyms:
AD4BP FTZF1 NR5A1 SF-1 STF-1 Steroid hormone receptor Ad4BP
Type:
Nuclear Hormone Receptor
Mol. Mass.:
51643.43
Organism:
Homo sapiens (Human)
Description:
Residue:
461
  
Inhibitor
Name:
BDBM39458
Synonyms:
3-[[5-[(4-chloranylphenoxy)methyl]-4-(furan-2-ylmethyl)-1,2,4-triazol-3-yl]sulfanylmethyl]-1,2,3-benzotriazin-4-one 3-[[[5-[(4-chlorophenoxy)methyl]-4-(2-furanylmethyl)-1,2,4-triazol-3-yl]thio]methyl]-1,2,3-benzotriazin-4-one MLS000053544 cid_2108763
Type:
Small organic molecule
Emp. Form.:
C22H17ClN6O3S
Mol. Mass.:
480.927
SMILES:
Clc1ccc(OCc2nnc(SCn3nnc4ccccc4c3=O)n2Cc2ccco2)cc1
: