Target
Steroidogenic factor 1
Ligand
BDBM39517
Substrate
Meas. Tech.
Counterscreen for activators of the Retinoic Acid Receptor-related orphan receptor A (RORA): A cell-based dose-response assay for inhibition of the Steroidogenic Factor 1 (SF-1)
EC50
>99000±n/a nM
Citation
 PubChem, PC Counterscreen for activators of the Retinoic Acid Receptor-related orphan receptor A (RORA): A cell-based dose-response assay for inhibition of the Steroidogenic Factor 1 (SF-1) PubChem Bioassay (2007)[AID] 
Target
Name:
Steroidogenic factor 1
Synonyms:
AD4BP FTZF1 NR5A1 SF-1 STF-1 Steroid hormone receptor Ad4BP
Type:
Nuclear Hormone Receptor
Mol. Mass.:
51643.43
Organism:
Homo sapiens (Human)
Description:
Residue:
461
  
Inhibitor
Name:
BDBM39517
Synonyms:
2-[2-(1-Cyclohexyl-1H-tetrazol-5-ylsulfanyl)-acetylamino]-benzoic acid ethyl ester 2-[[2-[(1-cyclohexyltetrazol-5-yl)thio]acetyl]amino]benzoic acid ethyl ester SMR000003775 ethyl 2-[2-[(1-cyclohexyl-1,2,3,4-tetrazol-5-yl)sulfanyl]ethanoylamino]benzoate | ethyl 2-[[2-(1-cyclohexyltetrazol-5-yl)sulfanylacetyl]amino]benzoate
Type:
Small organic molecule
Emp. Form.:
C18H23N5O3S
Mol. Mass.:
389.472
SMILES:
CCOC(=O)c1ccccc1NC(=O)CSc1nnnn1C1CCCCC1
: