Target
Steroidogenic factor 1
Ligand
BDBM39524
Substrate
Meas. Tech.
Counterscreen for activators of the Retinoic Acid Receptor-related orphan receptor A (RORA): A cell-based dose-response assay for inhibition of the Steroidogenic Factor 1 (SF-1)
EC50
>3667±n/a nM
Citation
 PubChem, PC Counterscreen for activators of the Retinoic Acid Receptor-related orphan receptor A (RORA): A cell-based dose-response assay for inhibition of the Steroidogenic Factor 1 (SF-1) PubChem Bioassay (2007)[AID] 
Target
Name:
Steroidogenic factor 1
Synonyms:
AD4BP FTZF1 NR5A1 SF-1 STF-1 Steroid hormone receptor Ad4BP
Type:
Nuclear Hormone Receptor
Mol. Mass.:
51643.43
Organism:
Homo sapiens (Human)
Description:
Residue:
461
  
Inhibitor
Name:
BDBM39524
Synonyms:
(10H-Phenothiazin-2-yl)-carbamic acid ethyl ester N-(10H-phenothiazin-2-yl)carbamic acid ethyl ester cid_652628 | ethyl N-(10H-phenothiazin-2-yl)carbamate
Type:
Small organic molecule
Emp. Form.:
C15H14N2O2S
Mol. Mass.:
286.349
SMILES:
CCOC(=O)Nc1ccc2Sc3ccccc3Nc2c1
: