Target
Steroidogenic factor 1
Ligand
BDBM39528
Substrate
Meas. Tech.
Counterscreen for activators of the Retinoic Acid Receptor-related orphan receptor A (RORA): A cell-based dose-response assay for inhibition of the Steroidogenic Factor 1 (SF-1)
EC50
3423±n/a nM
Citation
 PubChem, PC Counterscreen for activators of the Retinoic Acid Receptor-related orphan receptor A (RORA): A cell-based dose-response assay for inhibition of the Steroidogenic Factor 1 (SF-1) PubChem Bioassay (2007)[AID] 
Target
Name:
Steroidogenic factor 1
Synonyms:
AD4BP FTZF1 NR5A1 SF-1 STF-1 Steroid hormone receptor Ad4BP
Type:
Nuclear Hormone Receptor
Mol. Mass.:
51643.43
Organism:
Homo sapiens (Human)
Description:
Residue:
461
  
Inhibitor
Name:
BDBM39528
Synonyms:
5-(2-furanylmethylamino)-2-(4-methylphenyl)-4-oxazolecarbonitrile 5-(furan-2-ylmethylamino)-2-(4-methylphenyl)-1,3-oxazole-4-carbonitrile MLS000072360 cid_655905
Type:
Small organic molecule
Emp. Form.:
C16H13N3O2
Mol. Mass.:
279.2933
SMILES:
Cc1ccc(cc1)-c1nc(C#N)c(NCc2ccco2)o1
: