Target
Steroidogenic factor 1
Ligand
BDBM39533
Substrate
Meas. Tech.
Counterscreen for activators of the Retinoic Acid Receptor-related orphan receptor A (RORA): A cell-based dose-response assay for inhibition of the Steroidogenic Factor 1 (SF-1)
EC50
4020±n/a nM
Citation
 PubChem, PC Counterscreen for activators of the Retinoic Acid Receptor-related orphan receptor A (RORA): A cell-based dose-response assay for inhibition of the Steroidogenic Factor 1 (SF-1) PubChem Bioassay (2007)[AID] 
Target
Name:
Steroidogenic factor 1
Synonyms:
AD4BP FTZF1 NR5A1 SF-1 STF-1 Steroid hormone receptor Ad4BP
Type:
Nuclear Hormone Receptor
Mol. Mass.:
51643.43
Organism:
Homo sapiens (Human)
Description:
Residue:
461
  
Inhibitor
Name:
BDBM39533
Synonyms:
5-(cyclopropylamino)-2-(4-ethoxyphenyl)-1,3-oxazole-4-carbonitrile 5-(cyclopropylamino)-2-p-phenetyl-oxazole-4-carbonitrile SMR000035582 | cid_661030
Type:
Small organic molecule
Emp. Form.:
C15H15N3O2
Mol. Mass.:
269.2985
SMILES:
CCOc1ccc(cc1)-c1nc(C#N)c(NC2CC2)o1
: