Target
Steroidogenic factor 1
Ligand
BDBM39542
Substrate
Meas. Tech.
Counterscreen for activators of the Retinoic Acid Receptor-related orphan receptor A (RORA): A cell-based dose-response assay for inhibition of the Steroidogenic Factor 1 (SF-1)
EC50
1297±n/a nM
Citation
 PubChem, PC Counterscreen for activators of the Retinoic Acid Receptor-related orphan receptor A (RORA): A cell-based dose-response assay for inhibition of the Steroidogenic Factor 1 (SF-1) PubChem Bioassay (2007)[AID] 
Target
Name:
Steroidogenic factor 1
Synonyms:
AD4BP FTZF1 NR5A1 SF-1 STF-1 Steroid hormone receptor Ad4BP
Type:
Nuclear Hormone Receptor
Mol. Mass.:
51643.43
Organism:
Homo sapiens (Human)
Description:
Residue:
461
  
Inhibitor
Name:
BDBM39542
Synonyms:
MLS000041972 N-[5-(2-methoxyphenyl)-1,3,4-thiadiazol-2-yl]ethanamide cid_665459
Type:
Small organic molecule
Emp. Form.:
C11H11N3O2S
Mol. Mass.:
249.289
SMILES:
COc1ccccc1-c1nnc(NC(C)=O)s1
: