Target
Steroidogenic factor 1
Ligand
BDBM39565
Substrate
Meas. Tech.
Counterscreen for activators of the Retinoic Acid Receptor-related orphan receptor A (RORA): A cell-based dose-response assay for inhibition of the Steroidogenic Factor 1 (SF-1)
EC50
233±n/a nM
Citation
 PubChem, PC Counterscreen for activators of the Retinoic Acid Receptor-related orphan receptor A (RORA): A cell-based dose-response assay for inhibition of the Steroidogenic Factor 1 (SF-1) PubChem Bioassay (2007)[AID] 
Target
Name:
Steroidogenic factor 1
Synonyms:
AD4BP FTZF1 NR5A1 SF-1 STF-1 Steroid hormone receptor Ad4BP
Type:
Nuclear Hormone Receptor
Mol. Mass.:
51643.43
Organism:
Homo sapiens (Human)
Description:
Residue:
461
  
Inhibitor
Name:
BDBM39565
Synonyms:
2-(2-chlorophenyl)-5-(4-chlorophenyl)-1,3,4-oxadiazole SMR000103371 | cid_756156
Type:
Small organic molecule
Emp. Form.:
C14H8Cl2N2O
Mol. Mass.:
291.132
SMILES:
Clc1ccc(cc1)-c1nnc(o1)-c1ccccc1Cl
: