Target
Estrogen receptor
Ligand
BDBM34218
Substrate
Meas. Tech.
Estrogen Receptor-alpha Coactivator Binding Inhibitors Dose Response Confirmation
IC50
5104.59±n/a nM
Citation
 PubChem, PC Estrogen Receptor-alpha Coactivator Binding Inhibitors Dose Response Confirmation PubChem Bioassay (2007)[AID] 
Target
Name:
Estrogen receptor
Synonyms:
ER ESR ESR1_HUMAN Estrogen receptor Estrogen receptor (ER-alpha) Estrogen receptor alpha (ER) Nuclear receptor subfamily 3 group A member 1
Type:
Protein
Mol. Mass.:
66230.44
Organism:
Homo sapiens (Human)
Description:
P03372
Residue:
595
  
Inhibitor
Name:
BDBM34218
Synonyms:
3-[(E)-5'-(2-Cyano-ethylsulfanyl)-5,4'-dimethyl-[2,2']bi[[1,3]dithiolylidene]-4-ylsulfanyl]-propionitrile 3-[[(2E)-2-[4-(2-cyanoethylthio)-5-methyl-1,3-dithiol-2-ylidene]-5-methyl-1,3-dithiol-4-yl]thio]propanenitrile MLS000029767 cid_3137831
Type:
Small organic molecule
Emp. Form.:
C14H14N2S6
Mol. Mass.:
402.664
SMILES:
CC1=C(SCCC#N)S\C(S1)=C1/SC(C)=C(SCCC#N)S1
: