Target
Estrogen receptor
Ligand
BDBM39949
Substrate
Meas. Tech.
Estrogen Receptor-alpha Coactivator Binding Inhibitors Dose Response Confirmation
IC50
8229.68±n/a nM
Citation
 PubChem, PC Estrogen Receptor-alpha Coactivator Binding Inhibitors Dose Response Confirmation PubChem Bioassay (2007)[AID] 
Target
Name:
Estrogen receptor
Synonyms:
ER ESR ESR1_HUMAN Estrogen receptor Estrogen receptor (ER-alpha) Estrogen receptor alpha (ER) Nuclear receptor subfamily 3 group A member 1
Type:
Protein
Mol. Mass.:
66230.44
Organism:
Homo sapiens (Human)
Description:
P03372
Residue:
595
  
Inhibitor
Name:
BDBM39949
Synonyms:
MLS000053822 N-(6-ethyl-1,3-benzothiazol-2-yl)-2-(morpholin-4-ylmethyl)-4-oxidanylidene-1H-quinazoline-7-carboxamide N-(6-ethyl-1,3-benzothiazol-2-yl)-4-keto-2-(morpholinomethyl)-1H-quinazoline-7-carboxamide cid_2542796
Type:
Small organic molecule
Emp. Form.:
C23H23N5O3S
Mol. Mass.:
449.525
SMILES:
CCc1ccc2nc(NC(=O)c3ccc4c(c3)nc(CN3CCOCC3)[nH]c4=O)sc2c1
: