Target
Estrogen receptor
Ligand
BDBM40131
Substrate
Meas. Tech.
Estrogen Receptor-alpha Coactivator Binding Inhibitors Dose Response Confirmation
IC50
3106.81±n/a nM
Citation
 PubChem, PC Estrogen Receptor-alpha Coactivator Binding Inhibitors Dose Response Confirmation PubChem Bioassay (2007)[AID] 
Target
Name:
Estrogen receptor
Synonyms:
ER ESR ESR1_HUMAN Estrogen receptor Estrogen receptor (ER-alpha) Estrogen receptor alpha (ER) Nuclear receptor subfamily 3 group A member 1
Type:
Protein
Mol. Mass.:
66230.44
Organism:
Homo sapiens (Human)
Description:
P03372
Residue:
595
  
Inhibitor
Name:
BDBM40131
Synonyms:
4-bromanyl-2-[(E)-3-(2-chlorophenyl)prop-2-enoyl]-7-(ethylamino)cyclohepta-2,4,6-trien-1-one 4-bromo-2-[(E)-3-(2-chlorophenyl)acryloyl]-7-(ethylamino)cyclohepta-2,4,6-trien-1-one 4-bromo-2-[3-(2-chlorophenyl)acryloyl]-7-(ethylamino)-2,4,6-cycloheptatrien-1-one SMR000115632 | cid_7314646
Type:
Small organic molecule
Emp. Form.:
C18H15BrClNO2
Mol. Mass.:
392.674
SMILES:
CCNc1ccc(Br)cc(C(=O)\C=C\c2ccccc2Cl)c1=O
: