Target
Estrogen receptor
Ligand
BDBM40164
Substrate
Meas. Tech.
Estrogen Receptor-alpha Coactivator Binding Inhibitors Dose Response Confirmation
IC50
6621.2±n/a nM
Citation
 PubChem, PC Estrogen Receptor-alpha Coactivator Binding Inhibitors Dose Response Confirmation PubChem Bioassay (2007)[AID] 
Target
Name:
Estrogen receptor
Synonyms:
ER ESR ESR1_HUMAN Estrogen receptor Estrogen receptor (ER-alpha) Estrogen receptor alpha (ER) Nuclear receptor subfamily 3 group A member 1
Type:
Protein
Mol. Mass.:
66230.44
Organism:
Homo sapiens (Human)
Description:
P03372
Residue:
595
  
Inhibitor
Name:
BDBM40164
Synonyms:
7-(4-bromophenyl)-4-(3-pyridinyl)isoxazolo[3,4-d]pyridazine 7-(4-bromophenyl)-4-pyridin-3-yl-[1,2]oxazolo[3,4-d]pyridazine SMR000114637 | cid_1214599
Type:
Small organic molecule
Emp. Form.:
C16H9BrN4O
Mol. Mass.:
353.173
SMILES:
Brc1ccc(cc1)-c1nnc(-c2cccnc2)c2conc12
: