Target
Estrogen receptor
Ligand
BDBM33459
Substrate
Meas. Tech.
Estrogen Receptor-alpha Coactivator Binding Inhibitors Dose Response Confirmation
IC50
4234.1±n/a nM
Citation
 PubChem, PC Estrogen Receptor-alpha Coactivator Binding Inhibitors Dose Response Confirmation PubChem Bioassay (2007)[AID] 
Target
Name:
Estrogen receptor
Synonyms:
ER ESR ESR1_HUMAN Estrogen receptor Estrogen receptor (ER-alpha) Estrogen receptor alpha (ER) Nuclear receptor subfamily 3 group A member 1
Type:
Protein
Mol. Mass.:
66230.44
Organism:
Homo sapiens (Human)
Description:
P03372
Residue:
595
  
Inhibitor
Name:
BDBM33459
Synonyms:
(Z)-2-(6-methyl-1H-benzimidazol-2-yl)-3-(3-nitro-4-piperidin-1-yl-phenyl)prop-2-enenitrile (Z)-2-(6-methyl-1H-benzimidazol-2-yl)-3-(3-nitro-4-piperidino-phenyl)acrylonitrile 2-(5-methyl-1H-benzimidazol-2-yl)-3-[3-nitro-4-(1-piperidinyl)phenyl]acrylonitrile SMR000140480 | cid_5340140
Type:
Small organic molecule
Emp. Form.:
C22H21N5O2
Mol. Mass.:
387.4344
SMILES:
Cc1ccc2nc([nH]c2c1)C(=Cc1ccc(N2CCCCC2)c(c1)[N+]([O-])=O)C#N
: