Target
Ubiquitin carboxyl-terminal hydrolase BAP1
Ligand
BDBM40302
Substrate
Meas. Tech.
BAP1 Enzyme inhibitors Dose Response Confirmation
IC50
>50000±n/a nM
Citation
 PubChem, PC BAP1 Enzyme inhibitors Dose Response Confirmation PubChem Bioassay (2007)[AID] 
Target
Name:
Ubiquitin carboxyl-terminal hydrolase BAP1
Synonyms:
BAP1 KIAA0272 | Ubiquitin carboxyl-terminal hydrolase BAP1 (BRCA1-associated protein 1) (Cerebral protein 6).
Type:
Enzyme Catalytic Domain
Mol. Mass.:
80364.15
Organism:
Homo sapiens (Human)
Description:
gi_68565074
Residue:
729
  
Inhibitor
Name:
BDBM40302
Synonyms:
3-[1,3-bis(oxidanylidene)isoindol-2-yl]-N-(3-cyano-4,5-diphenyl-furan-2-yl)propanamide N-(3-cyano-4,5-diphenyl-2-furanyl)-3-(1,3-dioxo-2-isoindolyl)propanamide N-(3-cyano-4,5-diphenylfuran-2-yl)-3-(1,3-dioxoisoindol-2-yl)propanamide cid_2266566
Type:
Small organic molecule
Emp. Form.:
C28H19N3O4
Mol. Mass.:
461.4682
SMILES:
O=C(CCN1C(=O)c2ccccc2C1=O)Nc1oc(c(c1C#N)-c1ccccc1)-c1ccccc1
: