Target
Mothers against decapentaplegic homolog 3
Ligand
BDBM34182
Substrate
Meas. Tech.
SMAD Transcription Factor Inhibitors Dose Response Confirmation
IC50
19560±n/a nM
Citation
 PubChem, PC SMAD Transcription Factor Inhibitors Dose Response Confirmation PubChem Bioassay (2007)[AID] 
Target
Name:
Mothers against decapentaplegic homolog 3
Synonyms:
MADH3 SMAD3_HUMAN
Type:
Enzyme Catalytic Domain
Mol. Mass.:
48085.78
Organism:
Homo sapiens (Human)
Description:
gi_5174513
Residue:
425
  
Inhibitor
Name:
BDBM34182
Synonyms:
3-anilino-2H-isoquinolin-1-one 3-anilinoisoquinolin-1(2H)-one MLS000043701 cid_2142225
Type:
Small organic molecule
Emp. Form.:
C15H12N2O
Mol. Mass.:
236.2686
SMILES:
O=c1[nH]c(Nc2ccccc2)cc2ccccc12
: