Target
Mothers against decapentaplegic homolog 3
Ligand
BDBM34671
Substrate
Meas. Tech.
SMAD Transcription Factor Inhibitors Dose Response Confirmation
IC50
38±n/a nM
Citation
 PubChem, PC SMAD Transcription Factor Inhibitors Dose Response Confirmation PubChem Bioassay (2007)[AID] 
Target
Name:
Mothers against decapentaplegic homolog 3
Synonyms:
MADH3 SMAD3_HUMAN
Type:
Enzyme Catalytic Domain
Mol. Mass.:
48085.78
Organism:
Homo sapiens (Human)
Description:
gi_5174513
Residue:
425
  
Inhibitor
Name:
BDBM34671
Synonyms:
1,3,6-Trimethyl-1H-pyrimido[5,4-e][1,2,4]triazine-5,7-dione 1,3,6-trimethylpyrimido[5,4-e][1,2,4]triazine-5,7-quinone SMR000121073 cid_460747
Type:
Small organic molecule
Emp. Form.:
C8H9N5O2
Mol. Mass.:
207.1894
SMILES:
Cc1nn(C)c2nc(=O)n(C)c(=O)c2n1
: