Target
Coagulation factor XII
Ligand
BDBM40325
Substrate
Meas. Tech.
Factor XIIa Dose Response Confirmation
IC50
>50000±0 nM
Citation
 PubChem, PC Factor XIIa Dose Response Confirmation PubChem Bioassay (2008)[AID] 
Target
Name:
Coagulation factor XII
Synonyms:
Beta-factor XIIa part 1 Carboxylesterase 2 (intestine, liver) Coagulation factor XII (FXII) Coagulation factor XIIa light chain FA12_HUMAN Factor XIIa (fXIIa) Hageman factor
Type:
Enzyme
Mol. Mass.:
67810.07
Organism:
Homo sapiens (Human)
Description:
P00748
Residue:
615
  
Inhibitor
Name:
BDBM40325
Synonyms:
5-Oxo-tetrahydro-thiophene-3-carboxylic acid (tert-butylcarbamoyl-methyl)-(2,3-dihydro-benzo[1,4]dioxin-6-yl)-amide N-[2-(tert-butylamino)-2-keto-ethyl]-N-(2,3-dihydro-1,4-benzodioxin-6-yl)-5-keto-tetrahydrothiophene-3-carboxamide N-[2-(tert-butylamino)-2-oxoethyl]-N-(2,3-dihydro-1,4-benzodioxin-6-yl)-5-oxo-3-thiolanecarboxamide SMR000007769 | cid_644483
Type:
Small organic molecule
Emp. Form.:
C19H24N2O5S
Mol. Mass.:
392.469
SMILES:
CC(C)(C)NC(=O)CN(C(=O)C1CSC(=O)C1)c1ccc2OCCOc2c1
: