Target
Coagulation factor XII
Ligand
BDBM40327
Substrate
Meas. Tech.
Factor XIIa Dose Response Confirmation
IC50
>50000±0 nM
Citation
 PubChem, PC Factor XIIa Dose Response Confirmation PubChem Bioassay (2008)[AID] 
Target
Name:
Coagulation factor XII
Synonyms:
Beta-factor XIIa part 1 Carboxylesterase 2 (intestine, liver) Coagulation factor XII (FXII) Coagulation factor XIIa light chain FA12_HUMAN Factor XIIa (fXIIa) Hageman factor
Type:
Enzyme
Mol. Mass.:
67810.07
Organism:
Homo sapiens (Human)
Description:
P00748
Residue:
615
  
Inhibitor
Name:
BDBM40327
Synonyms:
Cyclopropanecarboxylic acid [2-cyclopropyl-3-(4-methoxy-benzyl)-4-oxo-3,4-dihydro-quinazolin-6-yl]-amide N-(2-cyclopropyl-4-keto-3-p-anisyl-quinazolin-6-yl)cyclopropanecarboxamide N-[2-cyclopropyl-3-[(4-methoxyphenyl)methyl]-4-oxo-6-quinazolinyl]cyclopropanecarboxamide SMR000005898 | cid_644793
Type:
Small organic molecule
Emp. Form.:
C23H23N3O3
Mol. Mass.:
389.447
SMILES:
COc1ccc(Cn2c(nc3ccc(NC(=O)C4CC4)cc3c2=O)C2CC2)cc1
: