Target
Coagulation factor XII
Ligand
BDBM34586
Substrate
Meas. Tech.
Factor XIIa Dose Response Confirmation
IC50
>50000±0 nM
Citation
 PubChem, PC Factor XIIa Dose Response Confirmation PubChem Bioassay (2008)[AID] 
Target
Name:
Coagulation factor XII
Synonyms:
Beta-factor XIIa part 1 Carboxylesterase 2 (intestine, liver) Coagulation factor XII (FXII) Coagulation factor XIIa light chain FA12_HUMAN Factor XIIa (fXIIa) Hageman factor
Type:
Enzyme
Mol. Mass.:
67810.07
Organism:
Homo sapiens (Human)
Description:
P00748
Residue:
615
  
Inhibitor
Name:
BDBM34586
Synonyms:
2',2',4-trimethylspiro[1,3-dihydrobenzo[f]quinoline-2,5'-1,3-dioxane]-4',6'-dione MLS000083554 cid_666313
Type:
Small organic molecule
Emp. Form.:
C19H19NO4
Mol. Mass.:
325.3585
SMILES:
CN1CC2(Cc3c1ccc1ccccc31)C(=O)OC(C)(C)OC2=O
: