Target
Coagulation factor XII
Ligand
BDBM40358
Substrate
Meas. Tech.
Factor XIIa Dose Response Confirmation
IC50
>50000±0 nM
Citation
 PubChem, PC Factor XIIa Dose Response Confirmation PubChem Bioassay (2008)[AID] 
Target
Name:
Coagulation factor XII
Synonyms:
Beta-factor XIIa part 1 Carboxylesterase 2 (intestine, liver) Coagulation factor XII (FXII) Coagulation factor XIIa light chain FA12_HUMAN Factor XIIa (fXIIa) Hageman factor
Type:
Enzyme
Mol. Mass.:
67810.07
Organism:
Homo sapiens (Human)
Description:
P00748
Residue:
615
  
Inhibitor
Name:
BDBM40358
Synonyms:
MLS000088528 N-[[4-(2-methoxyphenyl)-5-sulfanylidene-1H-1,2,4-triazol-3-yl]methyl]-2-phenoxyacetamide N-{[4-(2-methoxyphenyl)-5-thioxo-4,5-dihydro-1H-1,2,4-triazol-3-yl]methyl}-2-phenoxyacetamide cid_3237855
Type:
Small organic molecule
Emp. Form.:
C18H18N4O3S
Mol. Mass.:
370.426
SMILES:
COc1ccccc1-n1c(CNC(=O)COc2ccccc2)n[nH]c1=S
: