Target
Coagulation factor XII
Ligand
BDBM40393
Substrate
Meas. Tech.
Factor XIIa Dose Response Confirmation
IC50
>50000±0 nM
Citation
 PubChem, PC Factor XIIa Dose Response Confirmation PubChem Bioassay (2008)[AID] 
Target
Name:
Coagulation factor XII
Synonyms:
Beta-factor XIIa part 1 Carboxylesterase 2 (intestine, liver) Coagulation factor XII (FXII) Coagulation factor XIIa light chain FA12_HUMAN Factor XIIa (fXIIa) Hageman factor
Type:
Enzyme
Mol. Mass.:
67810.07
Organism:
Homo sapiens (Human)
Description:
P00748
Residue:
615
  
Inhibitor
Name:
BDBM40393
Synonyms:
(3Z)-3-(4-methyl-3-propylsulfanyl-1H-1,2,4-triazol-5-ylidene)indole MLS000102147 cid_5310405
Type:
Small organic molecule
Emp. Form.:
C14H16N4S
Mol. Mass.:
272.369
SMILES:
CCCSc1nnc(-c2c[nH]c3ccccc23)n1C
: