Target
N-formyl peptide receptor 2
Ligand
BDBM40401
Substrate
Meas. Tech.
Formylpeptide Receptor (FPR) Ligand Structure Activity Relationship (SAR) Analysis : Dose Response Assay Counterscreen Against Formyl Peptide Receptor-Like-1 (FPRL1)
Ki
>40300±n/a nM
Citation
 PubChem, PC Formylpeptide Receptor (FPR) Ligand Structure Activity Relationship (SAR) Analysis : Dose Response Assay Counterscreen Against Formyl Peptide Receptor-Like-1 (FPRL1)  PubChem Bioassay (2007)[AID] 
Target
Name:
N-formyl peptide receptor 2
Synonyms:
ALXR, FPRL1, FPR2 FPR2 FPRH1 Formyl Peptide Receptor-Like 1 LXA4 receptor Lipoxin A4 receptor RFP | hFPRL
Type:
G Protein-Coupled Receptor (GPCR)
Mol. Mass.:
38968.35
Organism:
Homo sapiens (Human)
Description:
P25090
Residue:
351
  
Inhibitor
Name:
BDBM40401
Synonyms:
(4Z)-1-hexyl-5-(3-methoxy-4-oxidanyl-phenyl)-4-[oxidanyl(phenyl)methylidene]pyrrolidine-2,3-dione (4Z)-1-hexyl-5-(4-hydroxy-3-methoxyphenyl)-4-[hydroxy(phenyl)methylidene]pyrrolidine-2,3-dione cid_5291143
Type:
Small organic molecule
Emp. Form.:
C24H27NO5
Mol. Mass.:
409.4749
SMILES:
CCCCCCN1C(C(C(=O)c2ccccc2)C(=O)C1=O)c1ccc(O)c(OC)c1
: