Target
N-formyl peptide receptor 2
Ligand
BDBM40409
Substrate
Meas. Tech.
Formylpeptide Receptor (FPR) Ligand Structure Activity Relationship (SAR) Analysis : Dose Response Assay Counterscreen Against Formyl Peptide Receptor-Like-1 (FPRL1)
IC50
>66700±n/a nM
Citation
 PubChem, PC Formylpeptide Receptor (FPR) Ligand Structure Activity Relationship (SAR) Analysis : Dose Response Assay Counterscreen Against Formyl Peptide Receptor-Like-1 (FPRL1)  PubChem Bioassay (2007)[AID] 
Target
Name:
N-formyl peptide receptor 2
Synonyms:
ALXR, FPRL1, FPR2 FPR2 FPRH1 Formyl Peptide Receptor-Like 1 LXA4 receptor Lipoxin A4 receptor RFP | hFPRL
Type:
G Protein-Coupled Receptor (GPCR)
Mol. Mass.:
38968.35
Organism:
Homo sapiens (Human)
Description:
P25090
Residue:
351
  
Inhibitor
Name:
BDBM40409
Synonyms:
(4E)-1-(3-chloranyl-4-methyl-phenyl)-5-(2,5-dimethoxyphenyl)-4-[oxidanyl(phenyl)methylidene]pyrrolidine-2,3-dione (4E)-1-(3-chloro-4-methylphenyl)-5-(2,5-dimethoxyphenyl)-4-[hydroxy(phenyl)methylidene]pyrrolidine-2,3-dione cid_5919212
Type:
Small organic molecule
Emp. Form.:
C26H22ClNO5
Mol. Mass.:
463.91
SMILES:
COc1ccc(OC)c(c1)C1C(C(=O)c2ccccc2)C(=O)C(=O)N1c1ccc(C)c(Cl)c1
: