Target
N-formyl peptide receptor 2
Ligand
BDBM40434
Substrate
Meas. Tech.
Formylpeptide Receptor (FPR) Ligand Structure Activity Relationship (SAR) Analysis : Dose Response Assay Counterscreen Against Formyl Peptide Receptor-Like-1 (FPRL1)
IC50
>66700±n/a nM
Citation
 PubChem, PC Formylpeptide Receptor (FPR) Ligand Structure Activity Relationship (SAR) Analysis : Dose Response Assay Counterscreen Against Formyl Peptide Receptor-Like-1 (FPRL1)  PubChem Bioassay (2007)[AID] 
Target
Name:
N-formyl peptide receptor 2
Synonyms:
ALXR, FPRL1, FPR2 FPR2 FPRH1 Formyl Peptide Receptor-Like 1 LXA4 receptor Lipoxin A4 receptor RFP | hFPRL
Type:
G Protein-Coupled Receptor (GPCR)
Mol. Mass.:
38968.35
Organism:
Homo sapiens (Human)
Description:
P25090
Residue:
351
  
Inhibitor
Name:
BDBM40434
Synonyms:
(4Z)-5-(4-bromophenyl)-1-(4-fluorophenyl)-4-[hydroxy(phenyl)methylene]pyrrolidine-2,3-quinone (4Z)-5-(4-bromophenyl)-1-(4-fluorophenyl)-4-[oxidanyl(phenyl)methylidene]pyrrolidine-2,3-dione cid_5291115
Type:
Small organic molecule
Emp. Form.:
C23H15BrFNO3
Mol. Mass.:
452.273
SMILES:
Fc1ccc(cc1)N1C(C(C(=O)c2ccccc2)C(=O)C1=O)c1ccc(Br)cc1
: