Target
Sphingosine 1-phosphate receptor 3
Ligand
BDBM31019
Substrate
Meas. Tech.
S1P3 Dose Response Assay Counterscreen for 5-Hydroxytryptamine(Serotonin) Receptor Subtype 1E Agonists
EC50
>40000±n/a nM
Citation
 PubChem, PC S1P3 Dose Response Assay Counterscreen for 5-Hydroxytryptamine(Serotonin) Receptor Subtype 1E Agonists PubChem Bioassay (2007)[AID] 
Target
Name:
Sphingosine 1-phosphate receptor 3
Synonyms:
C9orf108 EDG3 S1P receptor 3 S1P3 S1PR3_HUMAN Sphingosine 1-phosphate receptor 3 (S1P3) | Sphingosine 1-phosphate receptor Edg-3
Type:
G Protein-Coupled Receptor (GPCR)
Mol. Mass.:
42278.13
Organism:
Homo sapiens (Human)
Description:
Q99500
Residue:
378
  
Inhibitor
Name:
BDBM31019
Synonyms:
MLS000093991 N-[2-[4-(2,3-dimethylphenyl)piperazin-1-yl]ethyl]-2-(1-ethyl-4-oxidanylidene-furo[3,4]pyrrolo[3,5-c][1,2,4]triazin-3-yl)propanamide N-[2-[4-(2,3-dimethylphenyl)piperazino]ethyl]-2-(1-ethyl-4-keto-furo[3,4]pyrrolo[3,5-c][1,2,4]triazin-3-yl)propionamide SMR000029605 | cid_3235665
Type:
Small organic molecule
Emp. Form.:
C27H34N6O3
Mol. Mass.:
490.5973
SMILES:
CCc1nn(C(C)C(=O)NCCN2CCN(CC2)c2cccc(C)c2C)c(=O)c2cc3occc3n12
: