Target
Collagenase 3
Ligand
BDBM40475
Substrate
Meas. Tech.
Dose-response biochemical assay for inhibitors of Matrix Metalloproteinase 13 (MMP13) activity
IC50
5922±n/a nM
Citation
 PubChem, PC Dose-response biochemical assay for inhibitors of Matrix Metalloproteinase 13 (MMP13) activity PubChem Bioassay (2007)[AID] 
Target
Name:
Collagenase 3
Synonyms:
MMP-13 MMP13_HUMAN Matrix metalloproteinase-13 (MMP-13) | Matrix metalloproteinase-13 (MMP13)
Type:
Enzyme
Mol. Mass.:
53808.06
Organism:
Homo sapiens (Human)
Description:
P45452
Residue:
471
  
Inhibitor
Name:
BDBM40475
Synonyms:
5-keto-3-methyl-N-piperonyl-thiazolo[3,2-a]pyrimidine-6-carboxamide N-(1,3-benzodioxol-5-ylmethyl)-3-methyl-5-oxidanylidene-[1,3]thiazolo[3,2-a]pyrimidine-6-carboxamide N-(1,3-benzodioxol-5-ylmethyl)-3-methyl-5-oxo-[1,3]thiazolo[3,2-a]pyrimidine-6-carboxamide cid_4581082
Type:
Small organic molecule
Emp. Form.:
C16H13N3O4S
Mol. Mass.:
343.357
SMILES:
Cc1csc2ncc(C(=O)NCc3ccc4OCOc4c3)c(=O)n12
: