Target
Collagenase 3
Ligand
BDBM40477
Substrate
Meas. Tech.
Dose-response biochemical assay for inhibitors of Matrix Metalloproteinase 13 (MMP13) activity
IC50
>13280±n/a nM
Citation
 PubChem, PC Dose-response biochemical assay for inhibitors of Matrix Metalloproteinase 13 (MMP13) activity PubChem Bioassay (2007)[AID] 
Target
Name:
Collagenase 3
Synonyms:
MMP-13 MMP13_HUMAN Matrix metalloproteinase-13 (MMP-13) | Matrix metalloproteinase-13 (MMP13)
Type:
Enzyme
Mol. Mass.:
53808.06
Organism:
Homo sapiens (Human)
Description:
P45452
Residue:
471
  
Inhibitor
Name:
BDBM40477
Synonyms:
2-[(4-morpholin-4-ylsulfonylbenzoyl)amino]-6-propan-2-yl-5,7-dihydro-4H-thieno[2,3-c]pyridine-3-carboxamide 2-[[[4-(4-morpholinylsulfonyl)phenyl]-oxomethyl]amino]-6-propan-2-yl-5,7-dihydro-4H-thieno[2,3-c]pyridine-3-carboxamide MLS000100929 cid_4165356
Type:
Small organic molecule
Emp. Form.:
C22H28N4O5S2
Mol. Mass.:
492.612
SMILES:
CC(C)N1CCc2c(C1)sc(NC(=O)c1ccc(cc1)S(=O)(=O)N1CCOCC1)c2C(N)=O
: