Target
Collagenase 3
Ligand
BDBM50247259
Substrate
Meas. Tech.
Dose-response biochemical assay for inhibitors of Matrix Metalloproteinase 13 (MMP13) activity
IC50
11470±n/a nM
Citation
 PubChem, PC Dose-response biochemical assay for inhibitors of Matrix Metalloproteinase 13 (MMP13) activity PubChem Bioassay (2007)[AID] 
Target
Name:
Collagenase 3
Synonyms:
MMP-13 MMP13_HUMAN Matrix metalloproteinase-13 (MMP-13) | Matrix metalloproteinase-13 (MMP13)
Type:
Enzyme
Mol. Mass.:
53808.06
Organism:
Homo sapiens (Human)
Description:
P45452
Residue:
471
  
Inhibitor
Name:
BDBM50247259
Synonyms:
6-acetyl-5-(2,4-dimethoxyphenyl)-7-methyl-2-((1,2,5-trimethyl-1H-pyrrol-3-yl)methylene)-2H-thiazolo[3,2-a]pyrimidin-3(5H)-one cid_3560261
Type:
Small organic molecule
Emp. Form.:
C25H27N3O4S
Mol. Mass.:
465.565
SMILES:
COc1ccc(C2C(C(C)=O)=C(C)N=c3sc(=Cc4cc(C)n(C)c4C)c(=O)n23)c(OC)c1
: