Target
Collagenase 3
Ligand
BDBM50247462
Substrate
Meas. Tech.
Dose-response biochemical assay for inhibitors of Matrix Metalloproteinase 13 (MMP13) activity
IC50
7669±n/a nM
Citation
 PubChem, PC Dose-response biochemical assay for inhibitors of Matrix Metalloproteinase 13 (MMP13) activity PubChem Bioassay (2007)[AID] 
Target
Name:
Collagenase 3
Synonyms:
MMP-13 MMP13_HUMAN Matrix metalloproteinase-13 (MMP-13) | Matrix metalloproteinase-13 (MMP13)
Type:
Enzyme
Mol. Mass.:
53808.06
Organism:
Homo sapiens (Human)
Description:
P45452
Residue:
471
  
Inhibitor
Name:
BDBM50247462
Synonyms:
CHEMBL516952 cid_1016400
Type:
Small organic molecule
Emp. Form.:
C24H20N2O6
Mol. Mass.:
432.4254
SMILES:
O=C(NCc1ccc2OCOc2c1)c1cccc(c1)C(=O)NCc1ccc2OCOc2c1
: