Target
Estrogen receptor
Ligand
BDBM40481
Substrate
Meas. Tech.
Estrogen Receptor-alpha Coactivator Binding Potentiators Dose Response Confirmation
EC50
14567.15±n/a nM
Citation
 PubChem, PC Estrogen Receptor-alpha Coactivator Binding Potentiators Dose Response Confirmation PubChem Bioassay (2007)[AID] 
Target
Name:
Estrogen receptor
Synonyms:
ER ESR ESR1_HUMAN Estrogen receptor Estrogen receptor (ER-alpha) Estrogen receptor alpha (ER) Nuclear receptor subfamily 3 group A member 1
Type:
Protein
Mol. Mass.:
66230.44
Organism:
Homo sapiens (Human)
Description:
P03372
Residue:
595
  
Inhibitor
Name:
BDBM40481
Synonyms:
Furan-2-carboxylic acid [1-(4-methyl-benzyl)-1H-benzoimidazol-2-yl]-amide N-[1-(4-methylbenzyl)benzimidazol-2-yl]-2-furamide N-[1-[(4-methylphenyl)methyl]benzimidazol-2-yl]furan-2-carboxamide cid_645654
Type:
Small organic molecule
Emp. Form.:
C20H17N3O2
Mol. Mass.:
331.3679
SMILES:
Cc1ccc(Cn2c(NC(=O)c3ccco3)nc3ccccc23)cc1
: