Target
Estrogen receptor
Ligand
BDBM40510
Substrate
Meas. Tech.
Estrogen Receptor-alpha Coactivator Binding Potentiators Dose Response Confirmation
EC50
11577.27±n/a nM
Citation
 PubChem, PC Estrogen Receptor-alpha Coactivator Binding Potentiators Dose Response Confirmation PubChem Bioassay (2007)[AID] 
Target
Name:
Estrogen receptor
Synonyms:
ER ESR ESR1_HUMAN Estrogen receptor Estrogen receptor (ER-alpha) Estrogen receptor alpha (ER) Nuclear receptor subfamily 3 group A member 1
Type:
Protein
Mol. Mass.:
66230.44
Organism:
Homo sapiens (Human)
Description:
P03372
Residue:
595
  
Inhibitor
Name:
BDBM40510
Synonyms:
4-[4-[(6-fluoro-1,3-benzothiazol-2-yl)carbamoyl]phenyl]sulfonylpiperazine-1-carboxylic acid ethyl ester MLS000087916 cid_3242303 ethyl 4-[4-[(6-fluoranyl-1,3-benzothiazol-2-yl)carbamoyl]phenyl]sulfonylpiperazine-1-carboxylate | ethyl 4-[4-[(6-fluoro-1,3-benzothiazol-2-yl)carbamoyl]phenyl]sulfonylpiperazine-1-carboxylate
Type:
Small organic molecule
Emp. Form.:
C21H21FN4O5S2
Mol. Mass.:
492.544
SMILES:
CCOC(=O)N1CCN(CC1)S(=O)(=O)c1ccc(cc1)C(=O)Nc1nc2ccc(F)cc2s1
: