Target
Estrogen receptor
Ligand
BDBM40524
Substrate
Meas. Tech.
Estrogen Receptor-alpha Coactivator Binding Potentiators Dose Response Confirmation
EC50
23055.73±n/a nM
Citation
 PubChem, PC Estrogen Receptor-alpha Coactivator Binding Potentiators Dose Response Confirmation PubChem Bioassay (2007)[AID] 
Target
Name:
Estrogen receptor
Synonyms:
ER ESR ESR1_HUMAN Estrogen receptor Estrogen receptor (ER-alpha) Estrogen receptor alpha (ER) Nuclear receptor subfamily 3 group A member 1
Type:
Protein
Mol. Mass.:
66230.44
Organism:
Homo sapiens (Human)
Description:
P03372
Residue:
595
  
Inhibitor
Name:
BDBM40524
Synonyms:
2-[(2-methyl-3-furoyl)amino]-4-(4-pyridyl)thiophene-3-carboxylic acid methyl ester MLS000066308 cid_1247236 methyl 2-[(2-methylfuran-3-carbonyl)amino]-4-pyridin-4-ylthiophene-3-carboxylate | methyl 2-[(2-methylfuran-3-yl)carbonylamino]-4-pyridin-4-yl-thiophene-3-carboxylate
Type:
Small organic molecule
Emp. Form.:
C17H14N2O4S
Mol. Mass.:
342.369
SMILES:
COC(=O)c1c(NC(=O)c2ccoc2C)scc1-c1ccncc1
: