Target
Nuclear receptor subfamily 4 group A member 1
Ligand
BDBM37752
Substrate
Meas. Tech.
High Throughput Fluorescence Polarization Screen for Bcl-B Phenotype Converters
IC50
7518.5±1110 nM
Citation
 PubChem, PC High Throughput Fluorescence Polarization Screen for Bcl-B Phenotype Converters PubChem Bioassay (2008)[AID] 
Target
Name:
Nuclear receptor subfamily 4 group A member 1
Synonyms:
GFRP1 NAK1 NR4A1_HUMAN | nuclear receptor subfamily 4, group A, member 1
Type:
Enzyme Catalytic Domain
Mol. Mass.:
64467.13
Organism:
Homo sapiens (Human)
Description:
gi_27894344
Residue:
598
  
Inhibitor
Name:
BDBM37752
Synonyms:
MLS000086406 SMR000021908 | cid_3245701
Type:
Small organic molecule
Emp. Form.:
C24H24N4O6
Mol. Mass.:
464.4706
SMILES:
CCOC(=O)N1CCN(CC1)c1cc(NCCC(O)=O)c2C(=O)c3ccccc3-c3onc1c23
: