Target
Nuclear receptor subfamily 4 group A member 1
Ligand
BDBM40727
Substrate
Meas. Tech.
High Throughput Fluorescence Polarization Screen for Bcl-B Phenotype Converters
IC50
2965.6±99.3 nM
Citation
 PubChem, PC High Throughput Fluorescence Polarization Screen for Bcl-B Phenotype Converters PubChem Bioassay (2008)[AID] 
Target
Name:
Nuclear receptor subfamily 4 group A member 1
Synonyms:
GFRP1 NAK1 NR4A1_HUMAN | nuclear receptor subfamily 4, group A, member 1
Type:
Enzyme Catalytic Domain
Mol. Mass.:
64467.13
Organism:
Homo sapiens (Human)
Description:
gi_27894344
Residue:
598
  
Inhibitor
Name:
BDBM40727
Synonyms:
MLS000537135 N-[(4-fluorobenzylidene)amino]-2-(2-furyl)cinchoninamide N-[(4-fluorophenyl)methylideneamino]-2-(furan-2-yl)quinoline-4-carboxamide cid_1226487
Type:
Small organic molecule
Emp. Form.:
C21H14FN3O2
Mol. Mass.:
359.3532
SMILES:
Fc1ccc(C=NNC(=O)c2cc(nc3ccccc23)-c2ccco2)cc1
: