Target
Nuclear receptor subfamily 4 group A member 1
Ligand
BDBM40728
Substrate
Meas. Tech.
High Throughput Fluorescence Polarization Screen for Bcl-B Phenotype Converters
IC50
1070.2±75.3 nM
Citation
 PubChem, PC High Throughput Fluorescence Polarization Screen for Bcl-B Phenotype Converters PubChem Bioassay (2008)[AID] 
Target
Name:
Nuclear receptor subfamily 4 group A member 1
Synonyms:
GFRP1 NAK1 NR4A1_HUMAN | nuclear receptor subfamily 4, group A, member 1
Type:
Enzyme Catalytic Domain
Mol. Mass.:
64467.13
Organism:
Homo sapiens (Human)
Description:
gi_27894344
Residue:
598
  
Inhibitor
Name:
BDBM40728
Synonyms:
2-[2-oxidanylidene-2-[2-[(Z)-(3-oxidanyl-4-oxidanylidene-cyclohexa-2,5-dien-1-ylidene)methyl]hydrazinyl]ethoxy]-N''-[(Z)-(3-oxidanyl-4-oxidanylidene-cyclohexa-2,5-dien-1-ylidene)methyl]benzohydrazide N'-(3,4-dihydroxybenzylidene)-2-{2-[2-(3,4-dihydroxybenzylidene)hydrazino]-2-oxoethoxy}benzohydrazide N''-[(Z)-(3-hydroxy-4-oxo-1-cyclohexa-2,5-dienylidene)methyl]-2-[2-[[(Z)-(3-hydroxy-4-oxo-1-cyclohexa-2,5-dienylidene)methyl]hydrazo]-2-oxoethoxy]benzohydrazide N'-[(Z)-(3-hydroxy-4-keto-cyclohexa-2,5-dien-1-ylidene)methyl]-2-[2-[N'-[(E)-(3-hydroxy-4-keto-cyclohexa-2,5-dien-1-ylidene)methyl]hydrazino]-2-keto-ethoxy]benzohydrazide SMR000161891 | cid_11958779
Type:
Small organic molecule
Emp. Form.:
C23H20N4O7
Mol. Mass.:
464.4275
SMILES:
Oc1ccc(C=NNC(=O)COc2ccccc2C(=O)NN=Cc2ccc(O)c(O)c2)cc1O
: