Target
Heat shock protein HSP 90-alpha
Ligand
BDBM32019
Substrate
Meas. Tech.
Cell-based secondary assay for identifying Hsp90 inhibitors that degrade Hsp90 client protein Her2
IC50
>30000±n/a nM
Citation
 PubChem, PC Cell-based secondary assay for identifying Hsp90 inhibitors that degrade Hsp90 client protein Her2 PubChem Bioassay (2007)[AID] 
Target
Name:
Heat shock protein HSP 90-alpha
Synonyms:
HS90A_HUMAN HSP86 HSP90AA1 HSPCA Heat shock 86 kDa Heat shock protein HSP 90-alpha (HSP90) LAP-2 Lipopolysaccharide-associated protein 2 heat shock protein 90kDa alpha (cytosolic), class A member 1 isoform 2
Type:
Molecular Chaperone
Mol. Mass.:
84623.45
Organism:
Homo sapiens (Human)
Description:
P07900
Residue:
732
  
Inhibitor
Name:
BDBM32019
Synonyms:
(11S)-11-methyl-15,17-bis(oxidanyl)-12-oxabicyclo[12.4.0]octadeca-1(18),14,16-triene-7,13-dione (11S)-15,17-dihydroxy-11-methyl-12-oxabicyclo[12.4.0]octadeca-1(18),14,16-triene-7,13-quinone CHEMBL491499 SMR000058193 | cid_108003
Type:
Small organic molecule
Emp. Form.:
C18H24O5
Mol. Mass.:
320.3802
SMILES:
C[C@H]1CCCC(=O)CCCCCc2cc(O)cc(O)c2C(=O)O1
: