Target
Heat shock protein HSP 90-alpha
Ligand
BDBM32074
Substrate
Meas. Tech.
Cell-based secondary assay for identifying Hsp90 inhibitors that degrade Hsp90 client protein Her2
IC50
>30000±n/a nM
Citation
 PubChem, PC Cell-based secondary assay for identifying Hsp90 inhibitors that degrade Hsp90 client protein Her2 PubChem Bioassay (2007)[AID] 
Target
Name:
Heat shock protein HSP 90-alpha
Synonyms:
HS90A_HUMAN HSP86 HSP90AA1 HSPCA Heat shock 86 kDa Heat shock protein HSP 90-alpha (HSP90) LAP-2 Lipopolysaccharide-associated protein 2 heat shock protein 90kDa alpha (cytosolic), class A member 1 isoform 2
Type:
Molecular Chaperone
Mol. Mass.:
84623.45
Organism:
Homo sapiens (Human)
Description:
P07900
Residue:
732
  
Inhibitor
Name:
BDBM32074
Synonyms:
1-ethyl-2-([1,2,4]triazolo[4,3-a]pyridin-3-ylsulfanylmethyl)benzimidazole-5-carboxylic acid 1-ethyl-2-[([1,2,4]triazolo[4,3-a]pyridin-3-ylthio)methyl]benzimidazole-5-carboxylic acid SMR000067059 | cid_2123860
Type:
Small organic molecule
Emp. Form.:
C17H15N5O2S
Mol. Mass.:
353.398
SMILES:
CCn1c(CSc2nnc3ccccn23)nc2cc(ccc12)C(O)=O
: