Target
Heat shock protein HSP 90-alpha
Ligand
BDBM40738
Substrate
Meas. Tech.
Cell-based secondary assay for identifying Hsp90 inhibitors that degrade Hsp90 client protein Her2
IC50
>50000±n/a nM
Citation
 PubChem, PC Cell-based secondary assay for identifying Hsp90 inhibitors that degrade Hsp90 client protein Her2 PubChem Bioassay (2007)[AID] 
Target
Name:
Heat shock protein HSP 90-alpha
Synonyms:
HS90A_HUMAN HSP86 HSP90AA1 HSPCA Heat shock 86 kDa Heat shock protein HSP 90-alpha (HSP90) LAP-2 Lipopolysaccharide-associated protein 2 heat shock protein 90kDa alpha (cytosolic), class A member 1 isoform 2
Type:
Molecular Chaperone
Mol. Mass.:
84623.45
Organism:
Homo sapiens (Human)
Description:
P07900
Residue:
732
  
Inhibitor
Name:
BDBM40738
Synonyms:
4-aminobutyl-(6-methoxy-8-quinolyl)amine N'-(6-methoxyquinolin-8-yl)butane-1,4-diamine | cid_231916
Type:
Small organic molecule
Emp. Form.:
C14H19N3O
Mol. Mass.:
245.3202
SMILES:
COc1cc(NCCCCN)c2ncccc2c1
: