Target
Poly [ADP-ribose] polymerase 1
Ligand
BDBM191986
Substrate
Meas. Tech.
PARP-1 ELISA Assay
Temperature
298.15±n/a K
IC50
15.0±n/a nM
Comments
extracted
Citation
 Ji, JGuo, NXue, TKang, BYe, XChen, XZhang, T Poly (ADP-ribose) polymerase inhibitor US Patent  US9718787 Publication Date 8/1/2017 
Target
Name:
Poly [ADP-ribose] polymerase 1
Synonyms:
(ARTD1 or PARP1) 2.4.2.30 ADPRT ARTD1 Human diphtheria toxin-like ADP-ribosyltransferase (ARTD1 or PARP1) NT-PARP-1 PARP1 PPOL Poly [ADP-ribose] polymerase 1 (PARP) Poly [ADP-ribose] polymerase 1 (PARP1) Poly [ADP-ribose] polymerase 1, 28-kDa form Poly [ADP-ribose] polymerase 1, processed C-terminus Poly [ADP-ribose] polymerase-1 Poly(ADP-ribose) polymerase-1 (ARTD1/PARP1) Protein poly-ADP-ribosyltransferase PARP1 | Synonyms=ADPRT
Type:
Mol. Mass.:
113114.22
Organism:
Homo sapiens (Human)
Description:
P09874
Residue:
1014
  
Inhibitor
Name:
BDBM191986
Synonyms:
US9187430, 88 | US9718787, 88
Type:
Small organic molecule
Emp. Form.:
C26H20FN5O6
Mol. Mass.:
517.4653
SMILES:
[O-][N+](=O)c1ccccc1C(=O)N1CCN(CC1)C(=O)c1cc(Oc2n[nH]c(=O)c3ccccc23)ccc1F
: