Target
N-formyl peptide receptor 2
Ligand
BDBM40745
Substrate
Meas. Tech.
Formylpeptide Receptor (FPRL1) Ligand Structure Activity Relationship (SAR) Analysis : Dose Response Assay
IC50
>53600±n/a nM
Citation
 PubChem, PC Formylpeptide Receptor (FPRL1) Ligand Structure Activity Relationship (SAR) Analysis : Dose Response Assay PubChem Bioassay (2007)[AID] 
Target
Name:
N-formyl peptide receptor 2
Synonyms:
ALXR, FPRL1, FPR2 FPR2 FPRH1 Formyl Peptide Receptor-Like 1 LXA4 receptor Lipoxin A4 receptor RFP | hFPRL
Type:
G Protein-Coupled Receptor (GPCR)
Mol. Mass.:
38968.35
Organism:
Homo sapiens (Human)
Description:
P25090
Residue:
351
  
Inhibitor
Name:
BDBM40745
Synonyms:
2-[4-(2-methoxyphenyl)-1-piperazinyl]-4-phenyl-6-(trifluoromethyl)pyrimidine 2-[4-(2-methoxyphenyl)piperazino]-4-phenyl-6-(trifluoromethyl)pyrimidine cid_3243240
Type:
Small organic molecule
Emp. Form.:
C22H21F3N4O
Mol. Mass.:
414.4235
SMILES:
COc1ccccc1N1CCN(CC1)c1nc(cc(n1)C(F)(F)F)-c1ccccc1
: