Target
N-formyl peptide receptor 2
Ligand
BDBM40753
Substrate
Meas. Tech.
Formylpeptide Receptor (FPRL1) Ligand Structure Activity Relationship (SAR) Analysis : Dose Response Assay
IC50
>56000±n/a nM
Citation
 PubChem, PC Formylpeptide Receptor (FPRL1) Ligand Structure Activity Relationship (SAR) Analysis : Dose Response Assay PubChem Bioassay (2007)[AID] 
Target
Name:
N-formyl peptide receptor 2
Synonyms:
ALXR, FPRL1, FPR2 FPR2 FPRH1 Formyl Peptide Receptor-Like 1 LXA4 receptor Lipoxin A4 receptor RFP | hFPRL
Type:
G Protein-Coupled Receptor (GPCR)
Mol. Mass.:
38968.35
Organism:
Homo sapiens (Human)
Description:
P25090
Residue:
351
  
Inhibitor
Name:
BDBM40753
Synonyms:
2-chloranyl-6-fluoranyl-N-(5-imidazo[1,2-a]pyrimidin-2-yl-2-methoxy-phenyl)benzamide 2-chloro-6-fluoro-N-(5-imidazo[1,2-a]pyrimidin-2-yl-2-methoxyphenyl)benzamide UNM000003660901 | cid_7080279
Type:
Small organic molecule
Emp. Form.:
C20H14ClFN4O2
Mol. Mass.:
396.802
SMILES:
COc1ccc(cc1NC(=O)c1c(F)cccc1Cl)-c1cn2cccnc2n1
: