Target
Collagenase 3
Ligand
BDBM50247262
Substrate
Meas. Tech.
Dose response biochemical assay for autofluorescent inhibitors of Matrix Metalloproteinase 13 (MMP13) activity
IC50
3968±n/a nM
Citation
 PubChem, PC Dose response biochemical assay for autofluorescent inhibitors of Matrix Metalloproteinase 13 (MMP13) activity PubChem Bioassay (2007)[AID] 
Target
Name:
Collagenase 3
Synonyms:
MMP-13 MMP13_HUMAN Matrix metalloproteinase-13 (MMP-13) | Matrix metalloproteinase-13 (MMP13)
Type:
Enzyme
Mol. Mass.:
53808.06
Organism:
Homo sapiens (Human)
Description:
P45452
Residue:
471
  
Inhibitor
Name:
BDBM50247262
Synonyms:
3-(2-methoxy-6-(4-methoxyphenyl)pyridin-3-yl)-5-o-tolyl-1,2,4-oxadiazole cid_664499
Type:
Small organic molecule
Emp. Form.:
C22H19N3O3
Mol. Mass.:
373.4046
SMILES:
COc1ccc(cc1)-c1ccc(-c2noc(n2)-c2ccccc2C)c(OC)n1
: