Target
Sphingosine 1-phosphate receptor 3
Ligand
BDBM31053
Substrate
Meas. Tech.
S1P3 Dose Response Assay Counterscreen for 5-Hydroxytryptamine(Serotonin) Receptor Subtype 1E Antagonists
IC50
934±n/a nM
Citation
 PubChem, PC S1P3 Dose Response Assay Counterscreen for 5-Hydroxytryptamine(Serotonin) Receptor Subtype 1E Antagonists PubChem Bioassay (2007)[AID] 
Target
Name:
Sphingosine 1-phosphate receptor 3
Synonyms:
C9orf108 EDG3 S1P receptor 3 S1P3 S1PR3_HUMAN Sphingosine 1-phosphate receptor 3 (S1P3) | Sphingosine 1-phosphate receptor Edg-3
Type:
G Protein-Coupled Receptor (GPCR)
Mol. Mass.:
42278.13
Organism:
Homo sapiens (Human)
Description:
Q99500
Residue:
378
  
Inhibitor
Name:
BDBM31053
Synonyms:
8-fluoranyl-4-[4-(3-methoxyphenyl)-3-methyl-piperazin-1-yl]-5H-pyrimido[5,4-b]indole 8-fluoro-4-[4-(3-methoxyphenyl)-3-methyl-piperazino]-5H-pyrimid[5,4-b]indole MLS000078397 cid_659940
Type:
Small organic molecule
Emp. Form.:
C22H22FN5O
Mol. Mass.:
391.4414
SMILES:
COc1cccc(c1)N1CCN(CC1C)c1ncnc2c3cc(F)ccc3[nH]c12
: