Target
Protein phosphatase 1 regulatory subunit 1A
Ligand
BDBM40787
Substrate
Meas. Tech.
Inhibition Assay
IC50
11±n/a nM
Citation
 Wakimoto, TMatsunaga, STakai, AFusetani, N Insight into binding of calyculin A to protein phosphatase 1: isolation of hemicalyculin a and chemical transformation of calyculin A. Chem Biol 9:309-19 (2002)  
Target
Name:
Protein phosphatase 1 regulatory subunit 1A
Synonyms:
IPP1 PPR1A_HUMAN Protein phosphatase inhibitor 1
Type:
Protein
Mol. Mass.:
19010.07
Organism:
Homo sapiens (Human)
Description:
Q13522
Residue:
171
  
Inhibitor
Name:
BDBM40787
Synonyms:
Des-N-methylcalyculin A (20)
Type:
Small organic molecule
Emp. Form.:
C49H79N4O15P
Mol. Mass.:
995.1431
SMILES:
CN[C@@H](COC)C(O)[C@H](O)C(=O)NCCC(C)c1nc(\C=C\CC2OC3(C[C@@H](O)[C@@H]2C)O[C@H]([C@H](C[C@H](O)C(C)[C@H](O)C(C)\C=C(/C)\C(\C)=C\C=C\C(\C)=C\C#N)OC)[C@H](OP(O)(O)=O)C3(C)C)co1
: