Target
Heat shock 70 kDa protein 1A
Ligand
BDBM31694
Substrate
Meas. Tech.
TR-FRET secondary assay for HTS discovery of chemical inhibitors of Hsp70
IC50
>100000±0 nM
Citation
 PubChem, PC TR-FRET secondary assay for HTS discovery of chemical inhibitors of Hsp70 PubChem Bioassay (2008)[AID] 
Target
Name:
Heat shock 70 kDa protein 1A
Synonyms:
HSPA1A V9GZ37_HUMAN | heat shock 70kDa protein 1A
Type:
ATP-binding protein
Mol. Mass.:
51937.99
Organism:
Homo sapiens (Human)
Description:
gi_123271505; GST-tagged ATPase domain
Residue:
476
  
Inhibitor
Name:
BDBM31694
Synonyms:
MLS000077326 N-(7-acetyl-2,3-dihydro-1,4-benzodioxin-6-yl)acetamide SMR000009356 | cid_652324
Type:
Small organic molecule
Emp. Form.:
C12H13NO4
Mol. Mass.:
235.2359
SMILES:
CC(=O)Nc1cc2OCCOc2cc1C(C)=O
: