Target
Complement C1s subcomponent
Ligand
BDBM40810
Substrate
Meas. Tech.
Complement factor C1s IC50 from mixture screen
IC50
>50000±0 nM
Citation
 PubChem, PC Complement factor C1s IC50 from mixture screen PubChem Bioassay (2008)[AID] 
Target
Name:
Complement C1s subcomponent
Synonyms:
C1 esterase C1S_HUMAN Complement C1s subcomponent Complement C1s subcomponent light chain Trypsin | complement component 1, s subcomponent
Type:
Protein
Mol. Mass.:
76657.91
Organism:
Homo sapiens (Human)
Description:
P09871
Residue:
688
  
Inhibitor
Name:
BDBM40810
Synonyms:
3-(4-hydroxyphenyl)-2-(4-hydroxyphenyl)imino-1,3-thiazolidin-4-one 3-(4-hydroxyphenyl)-2-(4-hydroxyphenyl)imino-thiazolidin-4-one SMR000038851 | cid_657890
Type:
Small organic molecule
Emp. Form.:
C15H12N2O3S
Mol. Mass.:
300.332
SMILES:
Oc1ccc(cc1)\N=C1/SCC(=O)N1c1ccc(O)cc1
: