Target
Complement C1s subcomponent
Ligand
BDBM40816
Substrate
Meas. Tech.
Complement factor C1s IC50 from mixture screen
IC50
>50000±0 nM
Citation
 PubChem, PC Complement factor C1s IC50 from mixture screen PubChem Bioassay (2008)[AID] 
Target
Name:
Complement C1s subcomponent
Synonyms:
C1 esterase C1S_HUMAN Complement C1s subcomponent Complement C1s subcomponent light chain Trypsin | complement component 1, s subcomponent
Type:
Protein
Mol. Mass.:
76657.91
Organism:
Homo sapiens (Human)
Description:
P09871
Residue:
688
  
Inhibitor
Name:
BDBM40816
Synonyms:
8-ethoxy-4-(4-pyridin-2-ylpiperazin-1-yl)-5H-pyrimido[5,4-b]indole 8-ethoxy-4-[4-(2-pyridyl)piperazino]-5H-pyrimid[5,4-b]indole SMR000044529 | cid_663751
Type:
Small organic molecule
Emp. Form.:
C21H22N6O
Mol. Mass.:
374.439
SMILES:
CCOc1ccc2[nH]c3c(ncnc3c2c1)N1CCN(CC1)c1ccccn1
: