Target
Complement C1s subcomponent
Ligand
BDBM40832
Substrate
Meas. Tech.
Complement factor C1s IC50 from mixture screen
IC50
>50000±0 nM
Citation
 PubChem, PC Complement factor C1s IC50 from mixture screen PubChem Bioassay (2008)[AID] 
Target
Name:
Complement C1s subcomponent
Synonyms:
C1 esterase C1S_HUMAN Complement C1s subcomponent Complement C1s subcomponent light chain Trypsin | complement component 1, s subcomponent
Type:
Protein
Mol. Mass.:
76657.91
Organism:
Homo sapiens (Human)
Description:
P09871
Residue:
688
  
Inhibitor
Name:
BDBM40832
Synonyms:
(3,5-dimethyl-1,2-oxazol-4-yl)methyl 2-(2-phenylethanoylamino)benzoate 2-[(1-oxo-2-phenylethyl)amino]benzoic acid (3,5-dimethyl-4-isoxazolyl)methyl ester MLS000057228 cid_2571078
Type:
Small organic molecule
Emp. Form.:
C21H20N2O4
Mol. Mass.:
364.3945
SMILES:
Cc1noc(C)c1COC(=O)c1ccccc1NC(=O)Cc1ccccc1
: