Target
Complement C1s subcomponent
Ligand
BDBM31019
Substrate
Meas. Tech.
Complement factor C1s IC50 from mixture screen
IC50
>50000±0 nM
Citation
 PubChem, PC Complement factor C1s IC50 from mixture screen PubChem Bioassay (2008)[AID] 
Target
Name:
Complement C1s subcomponent
Synonyms:
C1 esterase C1S_HUMAN Complement C1s subcomponent Complement C1s subcomponent light chain Trypsin | complement component 1, s subcomponent
Type:
Protein
Mol. Mass.:
76657.91
Organism:
Homo sapiens (Human)
Description:
P09871
Residue:
688
  
Inhibitor
Name:
BDBM31019
Synonyms:
MLS000093991 N-[2-[4-(2,3-dimethylphenyl)piperazin-1-yl]ethyl]-2-(1-ethyl-4-oxidanylidene-furo[3,4]pyrrolo[3,5-c][1,2,4]triazin-3-yl)propanamide N-[2-[4-(2,3-dimethylphenyl)piperazino]ethyl]-2-(1-ethyl-4-keto-furo[3,4]pyrrolo[3,5-c][1,2,4]triazin-3-yl)propionamide SMR000029605 | cid_3235665
Type:
Small organic molecule
Emp. Form.:
C27H34N6O3
Mol. Mass.:
490.5973
SMILES:
CCc1nn(C(C)C(=O)NCCN2CCN(CC2)c2cccc(C)c2C)c(=O)c2cc3occc3n12
: