Target
Complement C1s subcomponent
Ligand
BDBM40857
Substrate
Meas. Tech.
Complement factor C1s IC50 from mixture screen
IC50
>50000±0 nM
Citation
 PubChem, PC Complement factor C1s IC50 from mixture screen PubChem Bioassay (2008)[AID] 
Target
Name:
Complement C1s subcomponent
Synonyms:
C1 esterase C1S_HUMAN Complement C1s subcomponent Complement C1s subcomponent light chain Trypsin | complement component 1, s subcomponent
Type:
Protein
Mol. Mass.:
76657.91
Organism:
Homo sapiens (Human)
Description:
P09871
Residue:
688
  
Inhibitor
Name:
BDBM40857
Synonyms:
5-(o-tolylsulfonylmethyl)-N-(3-pyridylmethyl)-2-furamide 5-[(2-methylphenyl)sulfonylmethyl]-N-(pyridin-3-ylmethyl)furan-2-carboxamide MLS000095156 cid_3244296
Type:
Small organic molecule
Emp. Form.:
C19H18N2O4S
Mol. Mass.:
370.422
SMILES:
Cc1ccccc1S(=O)(=O)Cc1ccc(o1)C(=O)NCc1cccnc1
: