Target
Complement C1s subcomponent
Ligand
BDBM40881
Substrate
Meas. Tech.
Complement factor C1s IC50 from mixture screen
IC50
>50000±0 nM
Citation
 PubChem, PC Complement factor C1s IC50 from mixture screen PubChem Bioassay (2008)[AID] 
Target
Name:
Complement C1s subcomponent
Synonyms:
C1 esterase C1S_HUMAN Complement C1s subcomponent Complement C1s subcomponent light chain Trypsin | complement component 1, s subcomponent
Type:
Protein
Mol. Mass.:
76657.91
Organism:
Homo sapiens (Human)
Description:
P09871
Residue:
688
  
Inhibitor
Name:
BDBM40881
Synonyms:
5-cyclopropyl-N-(5-methyl-1,2-oxazol-3-yl)-7-(trifluoromethyl)pyrazolo[1,5-a]pyrimidine-2-carboxamide 5-cyclopropyl-N-(5-methyl-3-isoxazolyl)-7-(trifluoromethyl)pyrazolo[1,5-a]pyrimidine-2-carboxamide MLS000052526 cid_2164708
Type:
Small organic molecule
Emp. Form.:
C15H12F3N5O2
Mol. Mass.:
351.2833
SMILES:
Cc1cc(NC(=O)c2cc3nc(cc(n3n2)C(F)(F)F)C2CC2)no1
: